BDBM92364 GPESB07
SMILES CO[C@@H]1O[C@H](Cn2cc(nn2)C2(O)CCCCC2)[C@@H]2OC(C)(C)OC12
InChI Key InChIKey=KEDSMYNZCHZVNL-XENFMFCUSA-N
Data  1 KI  1 IC50
  Tab Delimited (TSV)   2D SDfile   Computed 3D by Vconf -m prep SDfile
Find this compound or compounds like it in BindingDB:
Activity Spreadsheet -- Enzyme Inhibition Constant Data from BindingDB
Found 1 hit for monomerid = 92364
TargetPancreatic alpha-amylase(Sus scrofa (Pig))
Yonsei University
LigandPNGBDBM92364(GPESB07)
Affinity DataKi:  1.01E+6nM ΔG°:  -4.25kcal/mole IC50:  3.56E+5nMpH: 7.0 T: 2°C. Assay description: To test whether GCTs share a common binding pocket on PPA with acarbose, we performed an experiment according to the method of Yonetani and Theorell.
In DepthDetails ArticlePubMed