BDBM92414 PU01
SMILES Nc1nc(SCc2cccc3ccccc23)c2[nH]cnc2n1
InChI Key InChIKey=WPEBMRNXFWCMHU-UHFFFAOYSA-N
Data  1 IC50
  Tab Delimited (TSV)   2D SDfile   Computed 3D by Vconf -m prep SDfile
Find this compound or compounds like it in BindingDB:
Activity Spreadsheet -- Enzyme Inhibition Constant Data from BindingDB
Found 1 hit for monomerid = 92414
Target5-hydroxytryptamine receptor 3A(Homo sapiens (Human))
University Of Copenhagen
LigandPNGBDBM92414(PU01)
Affinity DataIC50:  490nMpH: 7.4 T: 2°C. Assay description: The screening of the compound library at the h5-HT3A-HEK293 cell line and the subsequent functional characterization of the compounds were performed ...
In DepthDetails ArticlePubMed