BDBM925 Aminodiol deriv. 16::[(S,R)-3-[[(R,S)-3-[[(1,1-Dimethylethoxy)carbonyl]amino]-2-hydroxy-4-phenylbutyl]amino]-2-hydroxy-1-(phenylmethyl)propyl]methylcarbamic Acid, 1,1-Dimethylethyl Ester::tert-butyl N-[(2S,3R)-4-{[(2R,3S)-3-{[(tert-butoxy)carbonyl](methyl)amino}-2-hydroxy-4-phenylbutyl]amino}-3-hydroxy-1-phenylbutan-2-yl]carbamate
SMILES CN([C@@H](Cc1ccccc1)[C@H](O)CNC[C@@H](O)[C@H](Cc1ccccc1)NC(=O)OC(C)(C)C)C(=O)OC(C)(C)C
InChI Key InChIKey=SSBSSFRLIFONBL-GWMMUDDPSA-N
Data  1 IC50
  Tab Delimited (TSV)   2D SDfile   Computed 3D by Vconf -m prep SDfile
Find this compound or compounds like it in BindingDB:
Activity Spreadsheet -- Enzyme Inhibition Constant Data from BindingDB
Found 1 hit for monomerid = 925
TargetDimer of Gag-Pol polyprotein [489-587](Human immunodeficiency virus type 1)
Bristol-Myers Squibb
LigandPNGBDBM925(Aminodiol deriv. 16 | [(S,R)-3-[[(R,S)-3-[[(1,1-Di...)
Affinity DataIC50:  8.50E+3nMpH: 5.5 T: 2°C. Assay description: Sensitivity of HIV-1 protease activity to protease inhibitors was determined by a peptide substrate cleavage assay. Protease products were analyzed o...
In DepthDetails ArticlePubMed