BDBM92539 IMP
SMILES OC1C(COP([O-])([O-])=O)OC(C1O)n1cnc2c1nc[nH]c2=O
InChI Key InChIKey=GRSZFWQUAKGDAV-UHFFFAOYSA-L
Data  1 KI
  Tab Delimited (TSV)   2D SDfile   Computed 3D by Vconf -m prep SDfile
Find this compound or compounds like it in BindingDB:
Activity Spreadsheet -- Enzyme Inhibition Constant Data from BindingDB
Found 1 hit for monomerid = 92539
Target2'-deoxynucleoside 5'-phosphate N-hydrolase 1(Rattus norvegicus (Rat))
Institut Pasteur
LigandPNGBDBM92539(IMP)
Affinity DataKi:  4.90E+4nM. Assay description: Rcl inhibition by nucleotides.
In DepthDetails ArticlePubMed