BDBM92584 ETP-45874, 11
SMILES Cc1cccc(Oc2nc(nc3n(C)ncc23)N2CCOCC2)c1
InChI Key InChIKey=RCXYMIYIJCKJHA-UHFFFAOYSA-N
Data  1 IC50
  Tab Delimited (TSV)   2D SDfile   Computed 3D by Vconf -m prep SDfile
Find this compound or compounds like it in BindingDB:
Activity Spreadsheet -- Enzyme Inhibition Constant Data from BindingDB
Found 1 hit for monomerid = 92584
TargetPhosphatidylinositol 4,5-bisphosphate 3-kinase catalytic subunit alpha isoform(Homo sapiens (Human))
Spanish National Cancer Research Center (Cnio)
LigandPNGBDBM92584(ETP-45874, 11)
Affinity DataIC50:  970nM. Assay description: Kinase assay using PI3K.
In DepthDetails ArticlePubMed