BDBM92643 EPZ000004
SMILES CN(C)CC1OC([C@H](O)[C@@H]1O)n1cnc2c(N)ncnc12
InChI Key InChIKey=SLNWRDWGFHZRAQ-HHJFIOHHSA-N
Data  1 KI
  Tab Delimited (TSV)   2D SDfile   Computed 3D by Vconf -m prep SDfile
Find this compound or compounds like it in BindingDB:
Activity Spreadsheet -- Enzyme Inhibition Constant Data from BindingDB
Found 1 hit for monomerid = 92643
LigandPNGBDBM92643(EPZ000004)
Affinity DataKi:  3.80E+4nM. Assay description: Assay of DOT1L enzymatic activity were performed under balanced conditions using a radiometric assay.
In DepthDetails ArticlePubMed