BDBM92667 Auxiliary substrate, 12a
SMILES CCCCCOC(=O)c1cccnc1
InChI Key InChIKey=SYIRQWIOOCVBTC-UHFFFAOYSA-N
Data  1 Kd
  Tab Delimited (TSV)   2D SDfile   Computed 3D by Vconf -m prep SDfile
Find this compound or compounds like it in BindingDB:
Activity Spreadsheet -- Enzyme Inhibition Constant Data from BindingDB
Found 1 hit for monomerid = 92667
TargetCytochrome P450 2E1(Homo sapiens (Human))
Mcgill University
LigandPNGBDBM92667(Auxiliary substrate, 12a)
Affinity DataKd:  5.90E+3nM. Assay description: All UV/Vis spectra of the enzyme-ligand complexes were obtained on a Cary 5000 UV/Vis spectrophotometer.
In DepthDetails ArticlePubMed