BDBM92676 Manolide
SMILES C\C(CCC1=C(C)CCCC1(C)C)=C/CCC1=CC[C@@H](O[C@H]1O)C1=CC(=O)OC1O
InChI Key InChIKey=FGJIDQWRRLDGDB-KREAIKSFSA-N
Data  1 IC50
  Tab Delimited (TSV)   2D SDfile   Computed 3D by Vconf -m prep SDfile
Find this compound or compounds like it in BindingDB:
Activity Spreadsheet -- Enzyme Inhibition Constant Data from BindingDB
Found 1 hit for monomerid = 92676
TargetPhospholipase A2(Homo sapiens (Human))
University Of California San Diego
LigandPNGBDBM92676(Manolide)
Affinity DataIC50:  1.30E+4nMpH: 9.0 T: 2°C. Assay description: Inhibition assay using phospholipase A2.
In DepthDetails PubMed