BDBM92681 3-Beta-Indole-acrylic acid (Tran), 1
SMILES [O-]C(=O)\C=C\c1c[nH]c2ccccc12
InChI Key InChIKey=PLVPPLCLBIEYEA-AATRIKPKSA-M
Data  1 Kd
  Tab Delimited (TSV)   2D SDfile   Computed 3D by Vconf -m prep SDfile
Find this compound or compounds like it in BindingDB:
Activity Spreadsheet -- Enzyme Inhibition Constant Data from BindingDB
Found 1 hit for monomerid = 92681
TargetTrp operon repressor(Escherichia coli (strain K12))
University Of Chicago
LigandPNGBDBM92681(3-Beta-Indole-acrylic acid (Tran), 1)
Affinity DataKd:  516nM. Assay description: Binding assay of L-trptophan and analogues to trp aporepressor
In DepthDetails PubMed