BDBM92899 NS3 Protease Inhibitor, 10
SMILES COc1ccc2c(O[C@@H]3C[C@H](N(C3)C(=O)[C@@H](NC(=O)OC(C)(C)C)C(C)C)C(=O)N[C@@]3(CC3C=C)C(=O)NS(=O)(=O)c3ccccc3)cc(nc2c1)-c1ccccc1
InChI Key InChIKey=DOPXVAXGWPVYNM-KXOUAARZSA-N
Data  1 KI
  Tab Delimited (TSV)   2D SDfile   Computed 3D by Vconf -m prep SDfile
Find this compound or compounds like it in BindingDB:
Activity Spreadsheet -- Enzyme Inhibition Constant Data from BindingDB
Found 1 hit for monomerid = 92899
TargetGenome polyprotein(Hepatitis C virus)
Uppsala University
LigandPNGBDBM92899(NS3 Protease Inhibitor, 10)
Affinity DataKi:  0.220nM. Assay description: Analysis of the inhibition activation of flNS3 by the inhibitors was performed with the standard assay, allowing the inhibitor to preincubate with NS...
In DepthDetails ArticlePubMed