BDBM92960 Piperazine derivative, 24
SMILES O[C@H](CCCCCOCc1c(F)c(F)c(N[N+]#N)c(F)c1F)CN1CCN(C[C@H](O)CCCCCOc2ccc(I)cc2)CC1
InChI Key InChIKey=SYBNQTLRDGKMFV-DNQXCXABSA-N
Data  1 IC50
  Tab Delimited (TSV)   2D SDfile   Computed 3D by Vconf -m prep SDfile
Find this compound or compounds like it in BindingDB:
Activity Spreadsheet -- Enzyme Inhibition Constant Data from BindingDB
Found 1 hit for monomerid = 92960
TargetNADH-ubiquinone oxidoreductase chain 1(Bos taurus (Bovine))
Kyoto University
LigandPNGBDBM92960(Piperazine derivative, 24)
Affinity DataIC50:  1nM. Assay description: Inhibition assay using NADH-ubiquinone oxidoreductase (complex I).
Ligand InfoPC cidPC sid
In DepthDetails ArticlePubMed