BDBM93176 Cathepsin Inhibitor, Column 3 Row 3
SMILES COc1ccc(cc1OC)C(=O)N[C@@H](C(C)C)C(=O)NC(C)C(=O)CNC(=O)Cc1cccc(c1)-c1ccccn1
InChI Key InChIKey=MEEMAABLXWWOIM-PRTIIRGTSA-N
Data  3 KI
  Tab Delimited (TSV)   2D SDfile   Computed 3D by Vconf -m prep SDfile
Find this compound or compounds like it in BindingDB:
Activity Spreadsheet -- Enzyme Inhibition Constant Data from BindingDB
Found 3 hits for monomerid = 93176
TargetCathepsin K(Homo sapiens (Human))
Smithkline Beecham Pharmaceuticals
LigandPNGBDBM93176(Cathepsin Inhibitor, Column 3 Row 3)
Affinity DataKi: >1.00E+3nMpH: 5.5Assay Description:Inhibitors were assayed against human liver Cathepsin L and B. Inhibitors were also evaluated for inhibition against purified recombinant Cathepsin ...
In DepthDetails ArticlePubMed
TargetCathepsin B(Homo sapiens (Human))
Smithkline Beecham Pharmaceuticals
LigandPNGBDBM93176(Cathepsin Inhibitor, Column 3 Row 3)
Affinity DataKi: >1.00E+3nMpH: 5.5Assay Description:Inhibitors were assayed against human liver Cathepsin L and B. Inhibitors were also evaluated for inhibition against purified recombinant Cathepsin ...
In DepthDetails ArticlePubMed
TargetCathepsin L(Homo sapiens (Human))
Smithkline Beecham Pharmaceuticals
LigandPNGBDBM93176(Cathepsin Inhibitor, Column 3 Row 3)
Affinity DataKi: >1.00E+3nMpH: 5.5Assay Description:Inhibitors were assayed against human liver Cathepsin L and B. Inhibitors were also evaluated for inhibition against purified recombinant Cathepsin ...
In DepthDetails ArticlePubMed