BDBM93223 Neoflavonoid derivative, 8c
SMILES Oc1c(CC=C)c(O)c2c(cc(=O)oc2c1CC=C)-c1ccccc1
InChI Key InChIKey=KDSCNSZCTQKSCH-UHFFFAOYSA-N
Data  1 IC50
  Tab Delimited (TSV)   2D SDfile   Computed 3D by Vconf -m prep SDfile
Find this compound or compounds like it in BindingDB:
Activity Spreadsheet -- Enzyme Inhibition Constant Data from BindingDB
Found 1 hit for monomerid = 93223
TargetGenome polyprotein(Hepatitis C virus genotype 1b (isolate BK) (HCV))
Umdnj-New Jersey Medical School
LigandPNGBDBM93223(Neoflavonoid derivative, 8c)
Affinity DataIC50:  4.58E+4nMpH: 7.0 T: 2°C. Assay description: Inhibition assay using HCV NS5B.
In DepthDetails ArticlePubMed