BDBM93269 Tetramic acid, 43
SMILES CCC(C)C1NC(=O)C(SCc2ccco2)C1=O
InChI Key InChIKey=MQNWUFYXWMVYJA-UHFFFAOYSA-N
Data  1 IC50
  Tab Delimited (TSV)   2D SDfile   Computed 3D by Vconf -m prep SDfile
Find this compound or compounds like it in BindingDB:
Activity Spreadsheet -- Enzyme Inhibition Constant Data from BindingDB
Found 1 hit for monomerid = 93269
TargetBeta-secretase 1(Homo sapiens (Human))
Darmstadt Technical University
LigandPNGBDBM93269(Tetramic acid, 43)
Affinity DataIC50:  2.00E+5nMT: 2°C. Assay description: The FRET assay was performed at 20 C on a FLUOstar (BMG Lab Technologies, D-77656 Offenburg) using 96-well microtiter plates (Dynex Microfluor 2, Cha...
Ligand InfoPC cidPC sid
In DepthDetails ArticlePubMed