BDBM93435 Flavonid, 5b
SMILES COc1cccc(Cl)c1\C=C\C(=O)c1ccc(F)cc1O
InChI Key InChIKey=INMMYTFQBCLGKO-BQYQJAHWSA-N
Data  1 IC50
  Tab Delimited (TSV)   2D SDfile   Computed 3D by Vconf -m prep SDfile
Find this compound or compounds like it in BindingDB:
Activity Spreadsheet -- Enzyme Inhibition Constant Data from BindingDB
Found 1 hit for monomerid = 93435
TargetCathepsin L2(Homo sapiens (Human))
Universidade Federal De SaO Carlo
LigandPNGBDBM93435(Flavonid, 5b)
Affinity DataIC50: >5.00E+4nMpH: 5.5 T: 2°C. Assay description: Recombinant human cathepsin V was expressed and purified as described previously.
Ligand InfoPC cidPC sid
In DepthDetails ArticlePubMed