BDBM93451 Flavonid, 6[1,4]
SMILES CC(C)(C)Oc1ccc(cc1)-c1cc(=O)c2ccc(Oc3ccccc3)cc2o1
InChI Key InChIKey=JPSWLXFQHOYDQR-UHFFFAOYSA-N
Data  1 IC50
  Tab Delimited (TSV)   2D SDfile   Computed 3D by Vconf -m prep SDfile
Find this compound or compounds like it in BindingDB:
Activity Spreadsheet -- Enzyme Inhibition Constant Data from BindingDB
Found 1 hit for monomerid = 93451
TargetCathepsin L2(Homo sapiens (Human))
Universidade Federal De SaO Carlo
LigandPNGBDBM93451(Flavonid, 6[1,4])
Affinity DataIC50:  2.70E+3nMpH: 5.5 T: 2°C. Assay description: Recombinant human cathepsin V was expressed and purified as described previously.
In DepthDetails ArticlePubMed