BDBM93543 (6aR,11aS)-6-cyclohexyl-3-methoxy-8-methyl-5-oxo-6a,11-dihydroindeno[1,2-c]isoquinoline-11a-carboxylic acid ethyl ester::(6aR,11aS)-6-cyclohexyl-5-keto-3-methoxy-8-methyl-6a,11-dihydroinden[1,2-c]isoquinoline-11a-carboxylic acid ethyl ester::MLS003591353::SMR002252652::cid_53301277::ethyl (6aR,11aS)-6-cyclohexyl-3-methoxy-8-methyl-5-oxidanylidene-6a,11-dihydroindeno[1,2-c]isoquinoline-11a-carboxylate::ethyl (6aR,11aS)-6-cyclohexyl-3-methoxy-8-methyl-5-oxo-6a,11-dihydroindeno[1,2-c]isoquinoline-11a-carboxylate
SMILES CCOC(=O)[C@]12Cc3ccc(C)cc3[C@H]1N(C1CCCCC1)C(=O)c1cc(OC)ccc21
InChI Key InChIKey=NHXPQRRVWUTAQQ-SQHAQQRYSA-N
Data  2 IC50
  Tab Delimited (TSV)   2D SDfile   Computed 3D by Vconf -m prep SDfile
Find this compound or compounds like it in BindingDB:
Activity Spreadsheet -- Enzyme Inhibition Constant Data from BindingDB
Found 2 hits for monomerid = 93543
TargetReceptor-interacting serine/threonine-protein kinase 2(Homo sapiens (Human))
The Scripps Research Institute Molecular Screening Center
Curated by PubChem BioAssay
LigandPNGBDBM93543((6aR,11aS)-6-cyclohexyl-3-methoxy-8-methyl-5-oxo-6...)
Affinity DataIC50:  2.32E+3nM
In DepthDetails PCBioAssay
TargetBeta-lactamase(Pseudomonas aeruginosa)
The Scripps Research Institute Molecular Screening Center
Curated by PubChem BioAssay
LigandPNGBDBM93543((6aR,11aS)-6-cyclohexyl-3-methoxy-8-methyl-5-oxo-6...)
Affinity DataIC50:  1.91E+4nM
In DepthDetails PCBioAssay