BDBM93685 5-nitro-2-furancarboxylic acid [2-oxo-2-[2-(4-sulfamoylphenyl)ethylamino]ethyl] ester::5-nitrofuran-2-carboxylic acid [2-keto-2-[2-(4-sulfamoylphenyl)ethylamino]ethyl] ester::MLS002245421::SMR001309073::[2-oxidanylidene-2-[2-(4-sulfamoylphenyl)ethylamino]ethyl] 5-nitrofuran-2-carboxylate::[2-oxo-2-[2-(4-sulfamoylphenyl)ethylamino]ethyl] 5-nitrofuran-2-carboxylate::cid_2083726
SMILES NS(=O)(=O)c1ccc(CCNC(=O)COC(=O)c2ccc(o2)[N+]([O-])=O)cc1
InChI Key InChIKey=AWJPKWODLKBIHU-UHFFFAOYSA-N
Data  3 IC50
  Tab Delimited (TSV)   2D SDfile   Computed 3D by Vconf -m prep SDfile
Find this compound or compounds like it in BindingDB:
Activity Spreadsheet -- Enzyme Inhibition Constant Data from BindingDB
Found 3 hits for monomerid = 93685
TargetSentrin-specific protease 8(Homo sapiens (Human))
Burnham Center For Chemical Genomics
Curated by PubChem BioAssay
LigandPNGBDBM93685(5-nitro-2-furancarboxylic acid [2-oxo-2-[2-(4-sulf...)
Affinity DataIC50:  9.20E+3nM
In DepthDetails PCBioAssay
TargetSentrin-specific protease 8(Homo sapiens (Human))
Burnham Center For Chemical Genomics
Curated by PubChem BioAssay
LigandPNGBDBM93685(5-nitro-2-furancarboxylic acid [2-oxo-2-[2-(4-sulf...)
Affinity DataIC50:  9.20E+3nM
In DepthDetails PCBioAssay
TargetCaspase-3(Homo sapiens (Human))
Burnham Center For Chemical Genomics
Curated by PubChem BioAssay
LigandPNGBDBM93685(5-nitro-2-furancarboxylic acid [2-oxo-2-[2-(4-sulf...)
Affinity DataIC50: >1.00E+5nM
In DepthDetails PCBioAssay