BDBM93804 2-(2-(4-fluorophenyl)-2H-tetrazol-5-yl)thiazole::2-[2-(4-fluorophenyl)-1,2,3,4-tetrazol-5-yl]-1,3-thiazole::2-[2-(4-fluorophenyl)-5-tetrazolyl]thiazole::2-[2-(4-fluorophenyl)tetrazol-5-yl]-1,3-thiazole::2-[2-(4-fluorophenyl)tetrazol-5-yl]thiazole::MLS000697784::SMR000327361::cid_16066570
SMILES Fc1ccc(cc1)-n1nnc(n1)-c1nccs1
InChI Key InChIKey=HXHXWVPMFRBDSD-UHFFFAOYSA-N
Data  2 IC50
  Tab Delimited (TSV)   2D SDfile   Computed 3D by Vconf -m prep SDfile
Find this compound or compounds like it in BindingDB:
Activity Spreadsheet -- Enzyme Inhibition Constant Data from BindingDB
Found 2 hits for monomerid = 93804
TargetHeat shock protein hsp-16.2(Caenorhabditis elegans)
Burnham Center For Chemical Genomics
Curated by PubChem BioAssay
LigandPNGBDBM93804(2-(2-(4-fluorophenyl)-2H-tetrazol-5-yl)thiazole | ...)
Affinity DataIC50:  5.00E+4nM
In DepthDetails PCBioAssay
TargetProtein skinhead-1(Caenorhabditis elegans)
Burnham Center For Chemical Genomics
Curated by PubChem BioAssay
LigandPNGBDBM93804(2-(2-(4-fluorophenyl)-2H-tetrazol-5-yl)thiazole | ...)
Affinity DataIC50:  2.44E+4nM
In DepthDetails PCBioAssay