BDBM93843 (Z)-(4-bromobenzyl)oxy-[1-(2-pyridyl)ethylidene]amine::(Z)-N-[(4-bromophenyl)methoxy]-1-(2-pyridinyl)ethanimine::(Z)-N-[(4-bromophenyl)methoxy]-1-pyridin-2-yl-ethanimine::(Z)-N-[(4-bromophenyl)methoxy]-1-pyridin-2-ylethanimine::1-(2-pyridinyl)-1-ethanone O-(4-bromobenzyl)oxime::MLS000755711::SMR000337380::cid_5903888
SMILES C\C(=N\OCc1ccc(Br)cc1)c1ccccn1
InChI Key InChIKey=PBNSAAZNKRYIIS-BOPFTXTBSA-N
Data  1 IC50  1 EC50
  Tab Delimited (TSV)   2D SDfile   Computed 3D by Vconf -m prep SDfile
Find this compound or compounds like it in BindingDB:
Activity Spreadsheet -- Enzyme Inhibition Constant Data from BindingDB
Found 2 hits for monomerid = 93843
TargetOxysterols receptor LXR-beta(Homo sapiens (Human))
The Scripps Research Institute Molecular Screening Center
Curated by PubChem BioAssay
LigandPNGBDBM93843((Z)-(4-bromobenzyl)oxy-[1-(2-pyridyl)ethylidene]am...)
Affinity DataEC50:  6.76E+4nM. Assay description: Source (MLPCN Center Name): The Scripps Research Institute Molecular Screening Center Affiliation: UT Southwestern Assay Provider: David Mangelsdorf,...
In DepthDetails PCBioAssay
TargetProtein skinhead-1(Caenorhabditis elegans)
Burnham Center For Chemical Genomics
Curated by PubChem BioAssay
LigandPNGBDBM93843((Z)-(4-bromobenzyl)oxy-[1-(2-pyridyl)ethylidene]am...)
Affinity DataIC50:  6.96E+4nM
In DepthDetails PCBioAssay