BDBM93859 3,6-diphenyl-1,2,4-triazine::MLS000911953::SMR000471597::cid_6617829
SMILES c1ccc(cc1)-c1cnc(nn1)-c1ccccc1
InChI Key InChIKey=LRGATPZENUYRBP-UHFFFAOYSA-N
Data  1 IC50  2 EC50
  Tab Delimited (TSV)   2D SDfile   Computed 3D by Vconf -m prep SDfile
Find this compound or compounds like it in BindingDB:
Activity Spreadsheet -- Enzyme Inhibition Constant Data from BindingDB
Found 3 hits for monomerid = 93859
TargetProtein skinhead-1(Caenorhabditis elegans)
Burnham Center For Chemical Genomics
Curated by PubChem BioAssay
LigandPNGBDBM93859(3,6-diphenyl-1,2,4-triazine | MLS000911953 | SMR00...)
Affinity DataIC50: >1.00E+5nM
In DepthDetails PCBioAssay
TargetNuclear hormone receptor family member daf-12(Caenorhabditis elegans)
The Scripps Research Institute Molecular Screening Center
Curated by PubChem BioAssay
LigandPNGBDBM93859(3,6-diphenyl-1,2,4-triazine | MLS000911953 | SMR00...)
Affinity DataEC50:  6.75E+4nM. Assay description: Source (MLPCN Center Name): The Scripps Research Institute Molecular Screening Center (SRIMSC) Affiliation: The Scripps Research Institute, TSRI Assa...
In DepthDetails PCBioAssay
TargetOxysterols receptor LXR-beta(Homo sapiens (Human))
The Scripps Research Institute Molecular Screening Center
Curated by PubChem BioAssay
LigandPNGBDBM93859(3,6-diphenyl-1,2,4-triazine | MLS000911953 | SMR00...)
Affinity DataEC50:  6.75E+4nM. Assay description: Source (MLPCN Center Name): The Scripps Research Institute Molecular Screening Center Affiliation: UT Southwestern Assay Provider: David Mangelsdorf,...
In DepthDetails PCBioAssay