BDBM93897 MLS001193363::N-[4-(4-methyl-1-piperazinyl)phenyl]-4-phenoxybenzamide::N-[4-(4-methylpiperazin-1-yl)phenyl]-4-phenoxy-benzamide::N-[4-(4-methylpiperazin-1-yl)phenyl]-4-phenoxybenzamide::N-[4-(4-methylpiperazino)phenyl]-4-phenoxy-benzamide::SMR000591962::cid_9118762
SMILES CN1CCN(CC1)c1ccc(NC(=O)c2ccc(Oc3ccccc3)cc2)cc1
InChI Key InChIKey=FIXJAWHYMVGECD-UHFFFAOYSA-N
Data  2 IC50
  Tab Delimited (TSV)   2D SDfile   Computed 3D by Vconf -m prep SDfile
Find this compound or compounds like it in BindingDB:
Activity Spreadsheet -- Enzyme Inhibition Constant Data from BindingDB
Found 2 hits for monomerid = 93897
TargetHeat shock protein hsp-16.2(Caenorhabditis elegans)
Burnham Center For Chemical Genomics
Curated by PubChem BioAssay
LigandPNGBDBM93897(MLS001193363 | N-[4-(4-methyl-1-piperazinyl)phenyl...)
Affinity DataIC50: >6.40E+4nM
In DepthDetails PCBioAssay
TargetProtein skinhead-1(Caenorhabditis elegans)
Burnham Center For Chemical Genomics
Curated by PubChem BioAssay
LigandPNGBDBM93897(MLS001193363 | N-[4-(4-methyl-1-piperazinyl)phenyl...)
Affinity DataIC50:  1.25E+4nM
In DepthDetails PCBioAssay