BDBM94080 (4-cyanophenyl)methyl 5,6-bis(chloranyl)pyridine-3-carboxylate::(4-cyanophenyl)methyl 5,6-dichloropyridine-3-carboxylate::5,6-dichloro-3-pyridinecarboxylic acid (4-cyanophenyl)methyl ester::5,6-dichloronicotinic acid (4-cyanobenzyl) ester::MLS001166707::SMR000591819::cid_2385614
SMILES Clc1cc(cnc1Cl)C(=O)OCc1ccc(cc1)C#N
InChI Key InChIKey=SGELVNJLPOJRTC-UHFFFAOYSA-N
Data  1 IC50
  Tab Delimited (TSV)   2D SDfile   Computed 3D by Vconf -m prep SDfile
Find this compound or compounds like it in BindingDB:
Activity Spreadsheet -- Enzyme Inhibition Constant Data from BindingDB
Found 1 hit for monomerid = 94080
TargetNeuropilin-1(Homo sapiens (Human))
Burnham Center For Chemical Genomics
Curated by PubChem BioAssay
LigandPNGBDBM94080((4-cyanophenyl)methyl 5,6-bis(chloranyl)pyridine-3...)
Affinity DataIC50: >9.50E+4nM
In DepthDetails PCBioAssay