BDBM94196 2-chloranyl-N-(4-morpholin-4-ylphenyl)-5-(1,2,4-triazol-4-yl)benzamide::2-chloro-N-(4-morpholin-4-ylphenyl)-5-(1,2,4-triazol-4-yl)benzamide::2-chloro-N-(4-morpholinophenyl)-5-(1,2,4-triazol-4-yl)benzamide::2-chloro-N-[4-(4-morpholinyl)phenyl]-5-(1,2,4-triazol-4-yl)benzamide::MLS001125100::SMR000668927::cid_1017707
SMILES Clc1ccc(cc1C(=O)Nc1ccc(cc1)N1CCOCC1)-n1cnnc1
InChI Key InChIKey=BNGJKNADMHPSRW-UHFFFAOYSA-N
Data  1 IC50
  Tab Delimited (TSV)   2D SDfile   Computed 3D by Vconf -m prep SDfile
Find this compound or compounds like it in BindingDB:
Activity Spreadsheet -- Enzyme Inhibition Constant Data from BindingDB
Found 1 hit for monomerid = 94196
TargetNeuropilin-1(Homo sapiens (Human))
Burnham Center For Chemical Genomics
Curated by PubChem BioAssay
LigandPNGBDBM94196(2-chloranyl-N-(4-morpholin-4-ylphenyl)-5-(1,2,4-tr...)
Affinity DataIC50: >9.50E+4nM
In DepthDetails PCBioAssay