BDBM9439 Heterodimeric Tacrine-Based Inhibitor 7k::N-4-Pyridyl-N-9-(1,2,3,4-tetrahydroacridinyl)-1,12-diaminododecane Bis-hydrochloride::N-[12-(1,2,3,4-tetrahydroacridin-9-ylamino)dodecyl]pyridin-4-amine dihydrochloride
SMILES C(CCCCCCNc1c2CCCCc2nc2ccccc12)CCCCCNc1ccncc1
InChI Key InChIKey=NGZVYWKVKNGTSQ-UHFFFAOYSA-N
Data  2 IC50
  Tab Delimited (TSV)   2D SDfile   Computed 3D by Vconf -m prep SDfile
Find this compound or compounds like it in BindingDB:
Activity Spreadsheet -- Enzyme Inhibition Constant Data from BindingDB
Found 2 hits for monomerid = 9439
TargetCarboxylic ester hydrolase(Rattus norvegicus (rat))
Hong Kong University Of Science And Technology
LigandPNGBDBM9439(Heterodimeric Tacrine-Based Inhibitor 7k | N-4-Pyr...)
Affinity DataIC50:  377nM. Assay description: The cholinesterase assays were performed using colorimetric method reported by Ellman. Enzyme activity was determined by measuring the absorbance at...
In DepthDetails ArticlePubMed
TargetAcetylcholinesterase(Rattus norvegicus (rat))
Hong Kong University Of Science And Technology
LigandPNGBDBM9439(Heterodimeric Tacrine-Based Inhibitor 7k | N-4-Pyr...)
Affinity DataIC50:  261nM. Assay description: The cholinesterase assays were performed using colorimetric method reported by Ellman. Enzyme activity was determined by measuring the absorbance at...
In DepthDetails ArticlePubMed