BDBM94731 4-(3-naphthalen-1-yl-1H-pyrazol-5-yl)piperidine::4-[3-(1-naphthalenyl)-1H-pyrazol-5-yl]piperidine::4-[3-(1-naphthyl)-1H-pyrazol-5-yl]piperidine::4-[5-(1-naphthyl)-1H-pyrazol-3-yl]piperidine::MLS000720773::SMR000336759::cid_1482145
SMILES C1CC(CCN1)c1cc(n[nH]1)-c1cccc2ccccc12
InChI Key InChIKey=KJCOJSQXSSWBOW-UHFFFAOYSA-N
Data  1 EC50
  Tab Delimited (TSV)   2D SDfile   Computed 3D by Vconf -m prep SDfile
Find this compound or compounds like it in BindingDB:
Activity Spreadsheet -- Enzyme Inhibition Constant Data from BindingDB
Found 1 hit for monomerid = 94731
TargetXylosyl- and glucuronyltransferase LARGE1(Homo sapiens (Human))
Burnham Center For Chemical Genomics
Curated by PubChem BioAssay
LigandPNGBDBM94731(4-(3-naphthalen-1-yl-1H-pyrazol-5-yl)piperidine | ...)
Affinity DataEC50: >8.00E+4nM
In DepthDetails PCBioAssay