BDBM94764 4-[amino(cyclohexyl)methyl]-N-(6-phenoxy-4-pyrimidinyl)-2-thiazolamine::4-[amino(cyclohexyl)methyl]-N-(6-phenoxypyrimidin-4-yl)-1,3-thiazol-2-amine::4-[azanyl(cyclohexyl)methyl]-N-(6-phenoxypyrimidin-4-yl)-1,3-thiazol-2-amine::MLS003123696::SMR001291726::[4-[amino(cyclohexyl)methyl]thiazol-2-yl]-(6-phenoxypyrimidin-4-yl)amine::cid_46948037
SMILES NC(C1CCCCC1)c1csc(Nc2cc(Oc3ccccc3)ncn2)n1
InChI Key InChIKey=ZEXONWXIDYOOAA-UHFFFAOYSA-N
Data  1 EC50
  Tab Delimited (TSV)   2D SDfile   Computed 3D by Vconf -m prep SDfile
Find this compound or compounds like it in BindingDB:
Activity Spreadsheet -- Enzyme Inhibition Constant Data from BindingDB
Found 1 hit for monomerid = 94764
TargetXylosyl- and glucuronyltransferase LARGE1(Homo sapiens (Human))
Burnham Center For Chemical Genomics
Curated by PubChem BioAssay
LigandPNGBDBM94764(4-[amino(cyclohexyl)methyl]-N-(6-phenoxy-4-pyrimid...)
Affinity DataEC50:  7.32E+3nM
Ligand InfoPC cidPC sid
In DepthDetails PCBioAssay