BDBM94809 5-[(4-methoxyphenyl)hydrazinylidene]-2-sulfanylidene-1,3-diazinane-4,6-dione::5-[(4-methoxyphenyl)hydrazono]-2-thioxo-hexahydropyrimidine-4,6-quinone::MLS000717858::SMR000279426::cid_5397361
SMILES [#6]-[#8]-c1ccc(-[#7]\[#7]=[#6]-2\[#6](=O)-[#7]-[#6](=S)-[#7]-[#6]-2=O)cc1
InChI Key InChIKey=GMLIUVPWAYTZNW-UHFFFAOYSA-N
Data  2 IC50
  Tab Delimited (TSV)   2D SDfile   Computed 3D by Vconf -m prep SDfile
Find this compound or compounds like it in BindingDB:
Activity Spreadsheet -- Enzyme Inhibition Constant Data from BindingDB
Found 2 hits for monomerid = 94809
TargetSentrin-specific protease 1(Homo sapiens (Human))
Burnham Center For Chemical Genomics
Curated by PubChem BioAssay
LigandPNGBDBM94809(5-[(4-methoxyphenyl)hydrazinylidene]-2-sulfanylide...)
Affinity DataIC50:  2.91E+4nM
In DepthDetails PCBioAssay
TargetSentrin-specific protease 1(Homo sapiens (Human))
Burnham Center For Chemical Genomics
Curated by PubChem BioAssay
LigandPNGBDBM94809(5-[(4-methoxyphenyl)hydrazinylidene]-2-sulfanylide...)
Affinity DataIC50:  1.66E+4nM
In DepthDetails PCBioAssay