BDBM95111 5-[(4-indolin-1-ylsulfonylphenyl)hydrazono]-2-thioxo-hexahydropyrimidine-4,6-quinone::5-[[4-(2,3-dihydroindol-1-ylsulfonyl)phenyl]hydrazinylidene]-2-sulfanylidene-1,3-diazinane-4,6-dione::MLS000680019::SMR000324636::cid_5629536
SMILES O=[#6]1-[#7]-[#6](=S)-[#7]-[#6](=O)\[#6]-1=[#7]\[#7]-c1ccc(cc1)S(=O)(=O)[#7]-1-[#6]-[#6]-c2ccccc-12
InChI Key InChIKey=DYMRQWPYFCBFCH-UHFFFAOYSA-N
Data  1 IC50  1 EC50
  Tab Delimited (TSV)   2D SDfile   Computed 3D by Vconf -m prep SDfile
Find this compound or compounds like it in BindingDB:
Activity Spreadsheet -- Enzyme Inhibition Constant Data from BindingDB
Found 2 hits for monomerid = 95111
TargetProbable global transcription activator SNF2L2(Homo sapiens (Human))
The Scripps Research Institute Molecular Screening Center
Curated by PubChem BioAssay
LigandPNGBDBM95111(5-[(4-indolin-1-ylsulfonylphenyl)hydrazono]-2-thio...)
Affinity DataEC50:  9.12E+4nM
In DepthDetails PCBioAssay
TargetProbable nicotinate-nucleotide adenylyltransferase(Staphylococcus aureus subsp. aureus N315)
Burnham Center For Chemical Genomics
Curated by PubChem BioAssay
LigandPNGBDBM95111(5-[(4-indolin-1-ylsulfonylphenyl)hydrazono]-2-thio...)
Affinity DataIC50:  6.24E+4nM
In DepthDetails PCBioAssay