BDBM95212 1-[(E)-[1-(2-cyanoethyl)-3-(4-phenylphenyl)pyrazol-4-yl]methylideneamino]thiourea::MLS001004672::SMR000348210::[(E)-[1-(2-cyanoethyl)-3-(4-phenylphenyl)-4-pyrazolyl]methylideneamino]thiourea::[(E)-[1-(2-cyanoethyl)-3-(4-phenylphenyl)pyrazol-4-yl]methyleneamino]thiourea::[(E)-[1-(2-cyanoethyl)-3-(4-phenylphenyl)pyrazol-4-yl]methylideneamino]thiourea::cid_6899916
SMILES NC(=S)NN=Cc1cn(CCC#N)nc1-c1ccc(cc1)-c1ccccc1
InChI Key InChIKey=PWIXYBHTQMQRBX-UHFFFAOYSA-N
Data  1 IC50
  Tab Delimited (TSV)   2D SDfile   Computed 3D by Vconf -m prep SDfile
Find this compound or compounds like it in BindingDB:
Activity Spreadsheet -- Enzyme Inhibition Constant Data from BindingDB
Found 1 hit for monomerid = 95212
TargetADP-ribosylation factor GTPase-activating protein 1(Rattus norvegicus)
The Scripps Research Institute Molecular Screening Center
Curated by PubChem BioAssay
LigandPNGBDBM95212(1-[(E)-[1-(2-cyanoethyl)-3-(4-phenylphenyl)pyrazol...)
Affinity DataIC50:  1.28E+5nM
In DepthDetails PCBioAssay