BDBM95303 MLS002170934::N-[4-[2-(2',5'-diketospiro[chroman-4,4'-imidazolidine]-1'-yl)acetyl]phenyl]-N-ethyl-methanesulfonamide::N-[4-[2-(2',5'-dioxo-1'-spiro[3,4-dihydro-2H-1-benzopyran-4,4'-imidazolidine]yl)-1-oxoethyl]phenyl]-N-ethylmethanesulfonamide::N-[4-[2-(2',5'-dioxospiro[2,3-dihydrochromene-4,4'-imidazolidine]-1'-yl)acetyl]phenyl]-N-ethylmethanesulfonamide::N-[4-[2-[2',5'-bis(oxidanylidene)spiro[2,3-dihydrochromene-4,4'-imidazolidine]-1'-yl]ethanoyl]phenyl]-N-ethyl-methanesulfonamide::SMR001251241::cid_16319467
SMILES CCN(c1ccc(cc1)C(=O)CN1C(=O)NC2(CCOc3ccccc23)C1=O)S(C)(=O)=O
InChI Key InChIKey=XDZVSANDXZUPGX-UHFFFAOYSA-N
Data  3 IC50
  Tab Delimited (TSV)   2D SDfile   Computed 3D by Vconf -m prep SDfile
Find this compound or compounds like it in BindingDB:
Activity Spreadsheet -- Enzyme Inhibition Constant Data from BindingDB
Found 3 hits for monomerid = 95303
TargetEnvelope glycoprotein gp160(Human immunodeficiency virus type 1 group M subtyp...)
The Scripps Research Institute Molecular Screening Center
Curated by PubChem BioAssay
LigandPNGBDBM95303(MLS002170934 | N-[4-[2-(2',5'-diketospiro[chroman-...)
Affinity DataIC50: >6.70E+4nM
In DepthDetails PCBioAssay
TargetEnvelope glycoprotein gp160(Human immunodeficiency virus type 1 group M subtyp...)
The Scripps Research Institute Molecular Screening Center
Curated by PubChem BioAssay
LigandPNGBDBM95303(MLS002170934 | N-[4-[2-(2',5'-diketospiro[chroman-...)
Affinity DataIC50: >6.70E+4nM
In DepthDetails PCBioAssay
TargetEnvelope glycoprotein gp160(Human immunodeficiency virus type 1 group M subtyp...)
The Scripps Research Institute Molecular Screening Center
Curated by PubChem BioAssay
LigandPNGBDBM95303(MLS002170934 | N-[4-[2-(2',5'-diketospiro[chroman-...)
Affinity DataIC50: >6.70E+4nM
In DepthDetails PCBioAssay