BDBM96087 1-(1-acetyl-2,3-dihydroindol-5-yl)-4-hydroxy-3-pyrazolecarboxylic acid ethyl ester::1-(1-acetylindolin-5-yl)-4-hydroxy-pyrazole-3-carboxylic acid ethyl ester::MLS000055452::SMR000065961::cid_705920::ethyl 1-(1-acetyl-2,3-dihydroindol-5-yl)-4-hydroxypyrazole-3-carboxylate::ethyl 1-(1-ethanoyl-2,3-dihydroindol-5-yl)-4-oxidanyl-pyrazole-3-carboxylate
SMILES CCOC(=O)c1nn(cc1O)-c1ccc2N(CCc2c1)C(C)=O
InChI Key InChIKey=FXDPTAUXQSIQBK-UHFFFAOYSA-N
Data  1 EC50
  Tab Delimited (TSV)   2D SDfile   Computed 3D by Vconf -m prep SDfile
Find this compound or compounds like it in BindingDB:
Activity Spreadsheet -- Enzyme Inhibition Constant Data from BindingDB
Found 1 hit for monomerid = 96087
TargetTumor necrosis factor receptor superfamily member 10B(Homo sapiens (Human))
Burnham Center For Chemical Genomics
Curated by PubChem BioAssay
LigandPNGBDBM96087(1-(1-acetyl-2,3-dihydroindol-5-yl)-4-hydroxy-3-pyr...)
Affinity DataEC50:  6.18E+3nM
In DepthDetails PCBioAssay