BDBM96095 4-(diethylsulfamoyl)benzoic acid [2-[4-(6-methyl-1,3-benzothiazol-2-yl)anilino]-2-oxoethyl] ester::4-(diethylsulfamoyl)benzoic acid [2-keto-2-[4-(6-methyl-1,3-benzothiazol-2-yl)anilino]ethyl] ester::MLS000395044::SMR000248410::[2-[4-(6-methyl-1,3-benzothiazol-2-yl)anilino]-2-oxoethyl] 4-(diethylsulfamoyl)benzoate::[2-[[4-(6-methyl-1,3-benzothiazol-2-yl)phenyl]amino]-2-oxidanylidene-ethyl] 4-(diethylsulfamoyl)benzoate::cid_2353548
SMILES CCN(CC)S(=O)(=O)c1ccc(cc1)C(=O)OCC(=O)Nc1ccc(cc1)-c1nc2ccc(C)cc2s1
InChI Key InChIKey=PGGQXUGPYJVIRG-UHFFFAOYSA-N
Data  2 EC50
  Tab Delimited (TSV)   2D SDfile   Computed 3D by Vconf -m prep SDfile
Find this compound or compounds like it in BindingDB:
Activity Spreadsheet -- Enzyme Inhibition Constant Data from BindingDB
Found 2 hits for monomerid = 96095
TargetOxysterols receptor LXR-beta(Homo sapiens (Human))
The Scripps Research Institute Molecular Screening Center
Curated by PubChem BioAssay
LigandPNGBDBM96095(4-(diethylsulfamoyl)benzoic acid [2-[4-(6-methyl-1...)
Affinity DataEC50:  6.75E+4nM. Assay description: Source (MLPCN Center Name): The Scripps Research Institute Molecular Screening Center Affiliation: UT Southwestern Assay Provider: David Mangelsdorf,...
In DepthDetails PCBioAssay
TargetTumor necrosis factor receptor superfamily member 10B(Homo sapiens (Human))
Burnham Center For Chemical Genomics
Curated by PubChem BioAssay
LigandPNGBDBM96095(4-(diethylsulfamoyl)benzoic acid [2-[4-(6-methyl-1...)
Affinity DataEC50: >1.25E+4nM
In DepthDetails PCBioAssay