BDBM96127 2-[5-(4-methylphenyl)-1,3-oxazol-2-yl]benzoic acid::2-[5-(4-methylphenyl)-2-oxazolyl]benzoic acid::2-[5-(p-tolyl)oxazol-2-yl]benzoic acid::MLS001176205::SMR000592513::cid_7131003
SMILES Cc1ccc(cc1)-c1cnc(o1)-c1ccccc1C(O)=O
InChI Key InChIKey=QHDXXCCWUXBCLN-UHFFFAOYSA-N
Data  1 IC50
  Tab Delimited (TSV)   2D SDfile   Computed 3D by Vconf -m prep SDfile
Find this compound or compounds like it in BindingDB:
Activity Spreadsheet -- Enzyme Inhibition Constant Data from BindingDB
Found 1 hit for monomerid = 96127
TargetFructose-bisphosphate aldolase(Mycobacterium tuberculosis (strain H37Rv))
The Scripps Research Institute Molecular Screening Center
Curated by PubChem BioAssay
LigandPNGBDBM96127(2-[5-(4-methylphenyl)-1,3-oxazol-2-yl]benzoic acid...)
Affinity DataIC50:  919nM
In DepthDetails PCBioAssay