BDBM96128 MLS003124447::N-methyl-6-[6-(4-methyl-1-piperazinyl)-3-pyridinyl]-2-pyridinamine::N-methyl-6-[6-(4-methylpiperazin-1-yl)pyridin-3-yl]pyridin-2-amine::SMR001285800::cid_49778840::methyl-[6-[6-(4-methylpiperazino)-3-pyridyl]-2-pyridyl]amine
SMILES CNc1cccc(n1)-c1ccc(nc1)N1CCN(C)CC1
InChI Key InChIKey=JGPSYJOBZFFPSE-UHFFFAOYSA-N
Data  1 IC50
  Tab Delimited (TSV)   2D SDfile   Computed 3D by Vconf -m prep SDfile
Find this compound or compounds like it in BindingDB:
Activity Spreadsheet -- Enzyme Inhibition Constant Data from BindingDB
Found 1 hit for monomerid = 96128
TargetFructose-bisphosphate aldolase(Mycobacterium tuberculosis (strain H37Rv))
The Scripps Research Institute Molecular Screening Center
Curated by PubChem BioAssay
LigandPNGBDBM96128(MLS003124447 | N-methyl-6-[6-(4-methyl-1-piperazin...)
Affinity DataIC50:  2.18E+3nM
Ligand InfoPC cidPC sid
In DepthDetails PCBioAssay