BDBM96149 4-[2-hydroxy-3-(2-isopropyl-5-methyl-cyclohexoxy)propyl]piperazine-1-carboxylic acid ethyl ester;hydrochloride::4-[2-hydroxy-3-(5-methyl-2-propan-2-ylcyclohexyl)oxypropyl]-1-piperazinecarboxylic acid ethyl ester;hydrochloride::MLS000534021::SMR000141457::cid_2770559::ethyl 4-[2-hydroxy-3-(5-methyl-2-propan-2-ylcyclohexyl)oxypropyl]piperazine-1-carboxylate;hydrochloride::ethyl 4-[3-(5-methyl-2-propan-2-yl-cyclohexyl)oxy-2-oxidanyl-propyl]piperazine-1-carboxylate;hydrochloride::ethyl 4-{2-hydroxy-3-[(2-isopropyl-5-methylcyclohexyl)oxy]propyl}-1-piperazinecarboxylate hydrochloride
SMILES CCOC(=O)N1CCN(CC(O)COC2CC(C)CCC2C(C)C)CC1
InChI Key InChIKey=GGAYKOPTOLHDON-UHFFFAOYSA-N
Data  1 IC50
  Tab Delimited (TSV)   2D SDfile   Computed 3D by Vconf -m prep SDfile
Find this compound or compounds like it in BindingDB:
Activity Spreadsheet -- Enzyme Inhibition Constant Data from BindingDB
Found 1 hit for monomerid = 96149
TargetFructose-bisphosphate aldolase(Mycobacterium tuberculosis (strain H37Rv))
The Scripps Research Institute Molecular Screening Center
Curated by PubChem BioAssay
LigandPNGBDBM96149(4-[2-hydroxy-3-(2-isopropyl-5-methyl-cyclohexoxy)p...)
Affinity DataIC50: >9.99E+3nM
In DepthDetails PCBioAssay