BDBM96164 2-keto-6-methoxy-N-methyl-chromene-3-carboxamide::6-methoxy-N-methyl-2-oxidanylidene-chromene-3-carboxamide::6-methoxy-N-methyl-2-oxo-1-benzopyran-3-carboxamide::6-methoxy-N-methyl-2-oxo-2H-chromene-3-carboxamide::6-methoxy-N-methyl-2-oxochromene-3-carboxamide::MLS000538333::SMR000144370::cid_2224621
SMILES CNC(=O)c1cc2cc(OC)ccc2oc1=O
InChI Key InChIKey=AXVPDXOFCSMKLU-UHFFFAOYSA-N
Data  1 IC50
  Tab Delimited (TSV)   2D SDfile   Computed 3D by Vconf -m prep SDfile
Find this compound or compounds like it in BindingDB:
Activity Spreadsheet -- Enzyme Inhibition Constant Data from BindingDB
Found 1 hit for monomerid = 96164
TargetFructose-bisphosphate aldolase(Mycobacterium tuberculosis (strain H37Rv))
The Scripps Research Institute Molecular Screening Center
Curated by PubChem BioAssay
LigandPNGBDBM96164(2-keto-6-methoxy-N-methyl-chromene-3-carboxamide |...)
Affinity DataIC50:  2.13E+3nM
In DepthDetails PCBioAssay