BDBM96228 (2Z)-2-[(4-methoxyphenyl)methylidene]-1-benzofuran-3-one::(2Z)-2-[(4-methoxyphenyl)methylidene]-3-benzofuranone::(2Z)-2-p-anisylidenecoumaran-3-one::MLS002473405::SMR001397496::cid_642384
SMILES COc1ccc(\C=C2/Oc3ccccc3C2=O)cc1
InChI Key InChIKey=WPHKUMCSOVGQCK-GDNBJRDFSA-N
Data  3 IC50
  Tab Delimited (TSV)   2D SDfile   Computed 3D by Vconf -m prep SDfile
Find this compound or compounds like it in BindingDB:
Activity Spreadsheet -- Enzyme Inhibition Constant Data from BindingDB
Found 3 hits for monomerid = 96228
TargetFructose-bisphosphate aldolase(Mycobacterium tuberculosis (strain H37Rv))
The Scripps Research Institute Molecular Screening Center
Curated by PubChem BioAssay
LigandPNGBDBM96228((2Z)-2-[(4-methoxyphenyl)methylidene]-1-benzofuran...)
Affinity DataIC50:  912nM
In DepthDetails PCBioAssay
TargetNeuraminidase(Influenza A virus (A/Puerto Rico/8/34/Mount Sinai(...)
Prin. K.M. Kundnani College Of Pharmacy
Curated by ChEMBL
LigandPNGBDBM96228((2Z)-2-[(4-methoxyphenyl)methylidene]-1-benzofuran...)
Affinity DataIC50:  3.75E+4nM. Assay description: Inhibition of Influenza A virus (H1N1) neuraminidase
In DepthDetails ArticlePubMed
TargetAcetylcholinesterase(Homo sapiens (Human))
University Of Gujrat
Curated by ChEMBL
LigandPNGBDBM96228((2Z)-2-[(4-methoxyphenyl)methylidene]-1-benzofuran...)
Affinity DataIC50:  1.26E+3nM. Assay description: Inhibition of acetylcholinesterase (unknown origin) using acetylthiocholine iodide as substrate incubated for 10 mins followed by substrate addition ...
In DepthDetails ArticlePubMed