BDBM96281 (5-bromo-1,3-benzoxazol-2-yl)amine::2-Benzoxazolamine, 5-bromo-::5-bromanyl-1,3-benzoxazol-2-amine::5-bromo-1,3-benzoxazol-2-amine::MLS002639030::SMR001548486::cid_46380
SMILES Nc1nc2cc(Br)ccc2o1
InChI Key InChIKey=HMRSJGDFTOUVBW-UHFFFAOYSA-N
Data  1 IC50
  Tab Delimited (TSV)   2D SDfile   Computed 3D by Vconf -m prep SDfile
Find this compound or compounds like it in BindingDB:
Activity Spreadsheet -- Enzyme Inhibition Constant Data from BindingDB
Found 1 hit for monomerid = 96281
TargetRecBCD enzyme subunit RecD(Escherichia coli str. K-12 substr. MG1655)
The Scripps Research Institute Molecular Screening Center
Curated by PubChem BioAssay
LigandPNGBDBM96281((5-bromo-1,3-benzoxazol-2-yl)amine | 2-Benzoxazola...)
Affinity DataIC50: >1.18E+5nM
In DepthDetails PCBioAssay