BDBM96294 4-(4-morpholinyl)-7-nitro-3-oxido-2,1,3-benzoxadiazol-3-ium::4-morpholin-4-yl-7-nitro-3-oxidanidyl-2,1,3-benzoxadiazol-3-ium::4-morpholin-4-yl-7-nitro-3-oxido-2,1,3-benzoxadiazol-3-ium::7-morpholino-4-nitro-1-oxido-benzofurazan-1-ium::Benzofurazan, 4-(4-morpholinyl)-7-nitro-, 3-oxide::MLS003115151::SMR001830734::cid_313562
SMILES [O-][N+](=O)c1c[cH-]c(N2CCOCC2)c2[c+]1[n-]o[n+]2=O
InChI Key InChIKey=VJBMAFLDXIZVDK-UHFFFAOYSA-N
Data  1 IC50
  Tab Delimited (TSV)   2D SDfile   Computed 3D by Vconf -m prep SDfile
Find this compound or compounds like it in BindingDB:
Activity Spreadsheet -- Enzyme Inhibition Constant Data from BindingDB
Found 1 hit for monomerid = 96294
TargetRecBCD enzyme subunit RecD(Escherichia coli str. K-12 substr. MG1655)
The Scripps Research Institute Molecular Screening Center
Curated by PubChem BioAssay
LigandPNGBDBM96294(4-(4-morpholinyl)-7-nitro-3-oxido-2,1,3-benzoxadia...)
Affinity DataIC50: >3.96E+4nM
In DepthDetails PCBioAssay