BDBM96314 3,5-dimethoxy-N'-{4-methoxy-3-[(2-naphthyloxy)methyl]benzylidene}benzohydrazide::3,5-dimethoxy-N-[(E)-[4-methoxy-3-(2-naphthalenyloxymethyl)phenyl]methylideneamino]benzamide::3,5-dimethoxy-N-[(E)-[4-methoxy-3-(2-naphthoxymethyl)benzylidene]amino]benzamide::3,5-dimethoxy-N-[(E)-[4-methoxy-3-(naphthalen-2-yloxymethyl)phenyl]methylideneamino]benzamide::MLS000544482::SMR000159535::cid_6873600
SMILES COc1cc(OC)cc(c1)C(=O)N\N=C\c1ccc(OC)c(COc2ccc3ccccc3c2)c1
InChI Key InChIKey=XPAZFJFLFHMOJV-STBIYBPSSA-N
Data  2 IC50
  Tab Delimited (TSV)   2D SDfile   Computed 3D by Vconf -m prep SDfile
Find this compound or compounds like it in BindingDB:
Activity Spreadsheet -- Enzyme Inhibition Constant Data from BindingDB
Found 2 hits for monomerid = 96314
TargetAlbumin(Bos taurus)
The Scripps Research Institute Molecular Screening Center
Curated by PubChem BioAssay
LigandPNGBDBM96314(3,5-dimethoxy-N'-{4-methoxy-3-[(2-naphthyloxy)...)
Affinity DataIC50: >9.41E+4nM
In DepthDetails PCBioAssay
TargetT cell receptor alpha variable 4(Homo sapiens (Human))
The Scripps Research Institute Molecular Screening Center
Curated by PubChem BioAssay
LigandPNGBDBM96314(3,5-dimethoxy-N'-{4-methoxy-3-[(2-naphthyloxy)...)
Affinity DataIC50: >9.41E+4nM
In DepthDetails PCBioAssay