BDBM96552 2-anilino-6-(1-pyrrolidinyl)-1H-1,3,5-triazin-4-one::2-anilino-6-pyrrolidin-1-yl-1H-1,3,5-triazin-4-one::2-anilino-6-pyrrolidino-1H-s-triazin-4-one::2-phenylazanyl-6-pyrrolidin-1-yl-1H-1,3,5-triazin-4-one::4-Phenylamino-6-pyrrolidin-1-yl-[1,3,5]triazin-2-ol::MLS000034572::SMR000013243::cid_647153
SMILES O=c1nc(nc(Nc2ccccc2)[nH]1)N1CCCC1
InChI Key InChIKey=PCRSSMCKONDMHH-UHFFFAOYSA-N
Data  2 IC50  2 EC50
  Tab Delimited (TSV)   2D SDfile   Computed 3D by Vconf -m prep SDfile
Find this compound or compounds like it in BindingDB:
Activity Spreadsheet -- Enzyme Inhibition Constant Data from BindingDB
Found 4 hits for monomerid = 96552
TargetGuanine nucleotide-binding protein subunit alpha-15(Homo sapiens (Human))
The Scripps Research Institute Molecular Screening Center
Curated by PubChem BioAssay
LigandPNGBDBM96552(2-anilino-6-(1-pyrrolidinyl)-1H-1,3,5-triazin-4-on...)
Affinity DataEC50: >2.99E+4nM
In DepthDetails PCBioAssay
TargetGuanine nucleotide-binding protein subunit alpha-15(Homo sapiens (Human))
The Scripps Research Institute Molecular Screening Center
Curated by PubChem BioAssay
LigandPNGBDBM96552(2-anilino-6-(1-pyrrolidinyl)-1H-1,3,5-triazin-4-on...)
Affinity DataIC50: >2.99E+4nM
In DepthDetails PCBioAssay
TargetTrace amine-associated receptor 1(Homo sapiens (Human))
The Scripps Research Institute Molecular Screening Center
Curated by PubChem BioAssay
LigandPNGBDBM96552(2-anilino-6-(1-pyrrolidinyl)-1H-1,3,5-triazin-4-on...)
Affinity DataEC50: >2.99E+4nM
In DepthDetails PCBioAssay
TargetTrace amine-associated receptor 1(Homo sapiens (Human))
The Scripps Research Institute Molecular Screening Center
Curated by PubChem BioAssay
LigandPNGBDBM96552(2-anilino-6-(1-pyrrolidinyl)-1H-1,3,5-triazin-4-on...)
Affinity DataIC50:  783nM
In DepthDetails PCBioAssay