BDBM96595 1-(2,3-Dihydro-benzo[1,4]dioxin-6-yl)-3-(3-phenyl-pyrrolidin-1-yl)-propan-1-one::1-(2,3-dihydro-1,4-benzodioxin-6-yl)-3-(3-phenyl-1-pyrrolidinyl)-1-propanone;hydrochloride::1-(2,3-dihydro-1,4-benzodioxin-6-yl)-3-(3-phenylpyrrolidin-1-yl)propan-1-one;hydrochloride::1-(2,3-dihydro-1,4-benzodioxin-6-yl)-3-(3-phenylpyrrolidino)propan-1-one;hydrochloride::MLS000526018::Pirroksan::SMR000116492::cid_36302
SMILES O=C(CCN1CCC(C1)c1ccccc1)c1ccc2OCCOc2c1
InChI Key InChIKey=GZIISXIDAZYOLI-UHFFFAOYSA-N
Data  2 IC50  2 EC50
  Tab Delimited (TSV)   2D SDfile   Computed 3D by Vconf -m prep SDfile
Find this compound or compounds like it in BindingDB:
Activity Spreadsheet -- Enzyme Inhibition Constant Data from BindingDB
Found 4 hits for monomerid = 96595
TargetGuanine nucleotide-binding protein subunit alpha-15(Homo sapiens (Human))
The Scripps Research Institute Molecular Screening Center
Curated by PubChem BioAssay
LigandPNGBDBM96595(1-(2,3-Dihydro-benzo[1,4]dioxin-6-yl)-3-(3-phenyl-...)
Affinity DataEC50: >2.99E+4nM
In DepthDetails PCBioAssay
TargetGuanine nucleotide-binding protein subunit alpha-15(Homo sapiens (Human))
The Scripps Research Institute Molecular Screening Center
Curated by PubChem BioAssay
LigandPNGBDBM96595(1-(2,3-Dihydro-benzo[1,4]dioxin-6-yl)-3-(3-phenyl-...)
Affinity DataIC50: >2.99E+4nM
In DepthDetails PCBioAssay
TargetTrace amine-associated receptor 1(Homo sapiens (Human))
The Scripps Research Institute Molecular Screening Center
Curated by PubChem BioAssay
LigandPNGBDBM96595(1-(2,3-Dihydro-benzo[1,4]dioxin-6-yl)-3-(3-phenyl-...)
Affinity DataEC50:  210nM
In DepthDetails PCBioAssay
TargetTrace amine-associated receptor 1(Homo sapiens (Human))
The Scripps Research Institute Molecular Screening Center
Curated by PubChem BioAssay
LigandPNGBDBM96595(1-(2,3-Dihydro-benzo[1,4]dioxin-6-yl)-3-(3-phenyl-...)
Affinity DataIC50:  1.46E+3nM
In DepthDetails PCBioAssay