BDBM96655 (6E)-4-chloranyl-6-[(2-phenylethylamino)methylidene]cyclohexa-2,4-dien-1-one::(6E)-4-chloro-6-[(2-phenylethylamino)methylidene]-1-cyclohexa-2,4-dienone::(6E)-4-chloro-6-[(2-phenylethylamino)methylidene]cyclohexa-2,4-dien-1-one::(6E)-4-chloro-6-[(phenethylamino)methylene]cyclohexa-2,4-dien-1-one::4-chloro-2-{[(2-phenylethyl)imino]methyl}phenol::MLS000699009::SMR000230665::cid_6508103
SMILES Oc1ccc(Cl)cc1C=NCCc1ccccc1
InChI Key InChIKey=BVBFOUQMCJEBKN-UHFFFAOYSA-N
Data  2 IC50  2 EC50
  Tab Delimited (TSV)   2D SDfile   Computed 3D by Vconf -m prep SDfile
Find this compound or compounds like it in BindingDB:
Activity Spreadsheet -- Enzyme Inhibition Constant Data from BindingDB
Found 4 hits for monomerid = 96655
TargetGuanine nucleotide-binding protein subunit alpha-15(Homo sapiens (Human))
The Scripps Research Institute Molecular Screening Center
Curated by PubChem BioAssay
LigandPNGBDBM96655((6E)-4-chloranyl-6-[(2-phenylethylamino)methyliden...)
Affinity DataEC50: >2.99E+4nM
In DepthDetails PCBioAssay
TargetGuanine nucleotide-binding protein subunit alpha-15(Homo sapiens (Human))
The Scripps Research Institute Molecular Screening Center
Curated by PubChem BioAssay
LigandPNGBDBM96655((6E)-4-chloranyl-6-[(2-phenylethylamino)methyliden...)
Affinity DataIC50:  9.79E+3nM
In DepthDetails PCBioAssay
TargetTrace amine-associated receptor 1(Homo sapiens (Human))
The Scripps Research Institute Molecular Screening Center
Curated by PubChem BioAssay
LigandPNGBDBM96655((6E)-4-chloranyl-6-[(2-phenylethylamino)methyliden...)
Affinity DataEC50:  42.5nM
In DepthDetails PCBioAssay
TargetTrace amine-associated receptor 1(Homo sapiens (Human))
The Scripps Research Institute Molecular Screening Center
Curated by PubChem BioAssay
LigandPNGBDBM96655((6E)-4-chloranyl-6-[(2-phenylethylamino)methyliden...)
Affinity DataIC50:  267nM
In DepthDetails PCBioAssay