BDBM9670 2-(4-{2-[(1-ethylcyclopentyl)(2-hydroxyethyl)carbamoyl]phenyl}-2-hydroxybutyl)-N-[3-hydroxy-2-(hydroxymethyl)propyl]-5-methyl-N-(2-phenylpropan-2-yl)benzamide::N-(1-Ethylcyclopentyl)-N-(2-hydroxyethyl)-2-[3-hydroxy-4-[2-[[3-hydroxy-2-(hydroxymethyl)propyl](1-methyl-1-phenylethyl)carbamoyl]-4-methylphenyl]butyl]-benzamide::Tertiary Amide deriv. 45
SMILES CCC1(CCCC1)N(CCO)C(=O)c1ccccc1CCC(O)Cc1ccc(C)cc1C(=O)N(CC(CO)CO)C(C)(C)c1ccccc1
InChI Key InChIKey=VOQZQCYEDQCVHB-UHFFFAOYSA-N
Data  1 KI
  Tab Delimited (TSV)   2D SDfile   Computed 3D by Vconf -m prep SDfile
Find this compound or compounds like it in BindingDB:
Activity Spreadsheet -- Enzyme Inhibition Constant Data from BindingDB
Found 1 hit for monomerid = 9670
TargetDimer of Gag-Pol polyprotein [489-587](Human immunodeficiency virus type 1)
Agouron Pharmaceuticals
LigandPNGBDBM9670(2-(4-{2-[(1-ethylcyclopentyl)(2-hydroxyethyl)carba...)
Affinity DataKi:  10nM. Assay description: Protease activity was measured by continuous chromogenic assay. The chromogenic peptide His-Lys-Ala-Arg-Val-Leu-(p-NO2-Phe)-Glu-Ala-Nleu-Ser was use...
In DepthDetails ArticlePubMed