BDBM96723 (E)-1,4-bis(3,4-dihydro-1H-isoquinolin-2-yl)-2-butene-1,4-dione::(E)-1,4-bis(3,4-dihydro-1H-isoquinolin-2-yl)but-2-ene-1,4-dione::MLS000737156::SMR000528395::cid_5357791
SMILES O=C(\C=C\C(=O)N1CCc2ccccc2C1)N1CCc2ccccc2C1
InChI Key InChIKey=CYOKMVNEKBJUHR-MDZDMXLPSA-N
Data  2 IC50  2 EC50
  Tab Delimited (TSV)   2D SDfile   Computed 3D by Vconf -m prep SDfile
Find this compound or compounds like it in BindingDB:
Activity Spreadsheet -- Enzyme Inhibition Constant Data from BindingDB
Found 4 hits for monomerid = 96723
TargetGuanine nucleotide-binding protein subunit alpha-15(Homo sapiens (Human))
The Scripps Research Institute Molecular Screening Center
Curated by PubChem BioAssay
LigandPNGBDBM96723((E)-1,4-bis(3,4-dihydro-1H-isoquinolin-2-yl)-2-but...)
Affinity DataEC50: >2.99E+4nM
Ligand InfoPC cidPC sid
In DepthDetails PCBioAssay
TargetGuanine nucleotide-binding protein subunit alpha-15(Homo sapiens (Human))
The Scripps Research Institute Molecular Screening Center
Curated by PubChem BioAssay
LigandPNGBDBM96723((E)-1,4-bis(3,4-dihydro-1H-isoquinolin-2-yl)-2-but...)
Affinity DataIC50: >2.99E+4nM
Ligand InfoPC cidPC sid
In DepthDetails PCBioAssay
TargetTrace amine-associated receptor 1(Homo sapiens (Human))
The Scripps Research Institute Molecular Screening Center
Curated by PubChem BioAssay
LigandPNGBDBM96723((E)-1,4-bis(3,4-dihydro-1H-isoquinolin-2-yl)-2-but...)
Affinity DataEC50:  1.14E+3nM
Ligand InfoPC cidPC sid
In DepthDetails PCBioAssay
TargetTrace amine-associated receptor 1(Homo sapiens (Human))
The Scripps Research Institute Molecular Screening Center
Curated by PubChem BioAssay
LigandPNGBDBM96723((E)-1,4-bis(3,4-dihydro-1H-isoquinolin-2-yl)-2-but...)
Affinity DataIC50:  4.67E+3nM
Ligand InfoPC cidPC sid
In DepthDetails PCBioAssay