BDBM96785 MLS001100781::N-[2-(2-fluorophenyl)ethyl]-2-[3-keto-1-(2-pyridylmethyl)piperazin-2-yl]acetamide::N-[2-(2-fluorophenyl)ethyl]-2-[3-oxidanylidene-1-(pyridin-2-ylmethyl)piperazin-2-yl]ethanamide::N-[2-(2-fluorophenyl)ethyl]-2-[3-oxo-1-(2-pyridinylmethyl)-2-piperazinyl]acetamide::N-[2-(2-fluorophenyl)ethyl]-2-[3-oxo-1-(pyridin-2-ylmethyl)piperazin-2-yl]acetamide::SMR000670077::cid_24793216
SMILES Fc1ccccc1CCNC(=O)CC1N(Cc2ccccn2)CCNC1=O
InChI Key InChIKey=NMOAQENNBHVGCP-UHFFFAOYSA-N
Data  2 IC50  2 EC50
  Tab Delimited (TSV)   2D SDfile   Computed 3D by Vconf -m prep SDfile
Find this compound or compounds like it in BindingDB:
Activity Spreadsheet -- Enzyme Inhibition Constant Data from BindingDB
Found 4 hits for monomerid = 96785
TargetGuanine nucleotide-binding protein subunit alpha-15(Homo sapiens (Human))
The Scripps Research Institute Molecular Screening Center
Curated by PubChem BioAssay
LigandPNGBDBM96785(MLS001100781 | N-[2-(2-fluorophenyl)ethyl]-2-[3-ke...)
Affinity DataEC50: >2.99E+4nM
In DepthDetails PCBioAssay
TargetGuanine nucleotide-binding protein subunit alpha-15(Homo sapiens (Human))
The Scripps Research Institute Molecular Screening Center
Curated by PubChem BioAssay
LigandPNGBDBM96785(MLS001100781 | N-[2-(2-fluorophenyl)ethyl]-2-[3-ke...)
Affinity DataIC50: >2.99E+4nM
In DepthDetails PCBioAssay
TargetTrace amine-associated receptor 1(Homo sapiens (Human))
The Scripps Research Institute Molecular Screening Center
Curated by PubChem BioAssay
LigandPNGBDBM96785(MLS001100781 | N-[2-(2-fluorophenyl)ethyl]-2-[3-ke...)
Affinity DataEC50:  2.12E+3nM
In DepthDetails PCBioAssay
TargetTrace amine-associated receptor 1(Homo sapiens (Human))
The Scripps Research Institute Molecular Screening Center
Curated by PubChem BioAssay
LigandPNGBDBM96785(MLS001100781 | N-[2-(2-fluorophenyl)ethyl]-2-[3-ke...)
Affinity DataIC50:  5.23E+3nM
In DepthDetails PCBioAssay