BDBM96908 2,6-bis(fluoranyl)-N-[2-[3-[(2-fluorophenyl)methylsulfanyl]indol-1-yl]ethyl]benzamide::2,6-difluoro-N-[2-[3-[(2-fluorobenzyl)thio]indol-1-yl]ethyl]benzamide::2,6-difluoro-N-[2-[3-[(2-fluorophenyl)methylsulfanyl]indol-1-yl]ethyl]benzamide::2,6-difluoro-N-[2-[3-[(2-fluorophenyl)methylthio]-1-indolyl]ethyl]benzamide::MLS000696939::SMR000237372::cid_5129679
SMILES Fc1ccccc1CSc1cn(CCNC(=O)c2c(F)cccc2F)c2ccccc12
InChI Key InChIKey=XQIPXGBPLYVWAO-UHFFFAOYSA-N
Data  2 IC50  2 EC50
  Tab Delimited (TSV)   2D SDfile   Computed 3D by Vconf -m prep SDfile
Find this compound or compounds like it in BindingDB:
Activity Spreadsheet -- Enzyme Inhibition Constant Data from BindingDB
Found 4 hits for monomerid = 96908
TargetTrace amine-associated receptor 1(Homo sapiens (Human))
The Scripps Research Institute Molecular Screening Center
Curated by PubChem BioAssay
LigandPNGBDBM96908(2,6-bis(fluoranyl)-N-[2-[3-[(2-fluorophenyl)methyl...)
Affinity DataEC50: >2.99E+4nM
In DepthDetails PCBioAssay
TargetTrace amine-associated receptor 1(Homo sapiens (Human))
The Scripps Research Institute Molecular Screening Center
Curated by PubChem BioAssay
LigandPNGBDBM96908(2,6-bis(fluoranyl)-N-[2-[3-[(2-fluorophenyl)methyl...)
Affinity DataIC50:  3.49E+3nM
In DepthDetails PCBioAssay
TargetGuanine nucleotide-binding protein subunit alpha-15(Homo sapiens (Human))
The Scripps Research Institute Molecular Screening Center
Curated by PubChem BioAssay
LigandPNGBDBM96908(2,6-bis(fluoranyl)-N-[2-[3-[(2-fluorophenyl)methyl...)
Affinity DataEC50: >2.99E+4nM
In DepthDetails PCBioAssay
TargetGuanine nucleotide-binding protein subunit alpha-15(Homo sapiens (Human))
The Scripps Research Institute Molecular Screening Center
Curated by PubChem BioAssay
LigandPNGBDBM96908(2,6-bis(fluoranyl)-N-[2-[3-[(2-fluorophenyl)methyl...)
Affinity DataIC50:  3.84E+4nM
In DepthDetails PCBioAssay