BDBM96956 4-(1,3-benzothiazol-2-yl)-N-(5-methyl-1,3-thiazol-2-yl)butanamide::4-(1,3-benzothiazol-2-yl)-N-(5-methyl-2-thiazolyl)butanamide::4-(1,3-benzothiazol-2-yl)-N-(5-methylthiazol-2-yl)butyramide::MLS000568842::SMR000154827::cid_2445782
SMILES Cc1cnc(NC(=O)CCCc2nc3ccccc3s2)s1
InChI Key InChIKey=MWYJTJSJYKOZSD-UHFFFAOYSA-N
Data  3 IC50  2 EC50
  Tab Delimited (TSV)   2D SDfile   Computed 3D by Vconf -m prep SDfile
Find this compound or compounds like it in BindingDB:
Activity Spreadsheet -- Enzyme Inhibition Constant Data from BindingDB
Found 5 hits for monomerid = 96956
TargetProbable global transcription activator SNF2L2(Homo sapiens (Human))
The Scripps Research Institute Molecular Screening Center
Curated by PubChem BioAssay
LigandPNGBDBM96956(4-(1,3-benzothiazol-2-yl)-N-(5-methyl-1,3-thiazol-...)
Affinity DataEC50:  9.12E+4nM
In DepthDetails PCBioAssay
TargetOxysterols receptor LXR-beta(Homo sapiens (Human))
The Scripps Research Institute Molecular Screening Center
Curated by PubChem BioAssay
LigandPNGBDBM96956(4-(1,3-benzothiazol-2-yl)-N-(5-methyl-1,3-thiazol-...)
Affinity DataIC50:  6.75E+4nM. Assay description: Source (MLPCN Center Name): The Scripps Research Institute Molecular Screening Center Affiliation: UT Southwestern Assay Provider: David Mangelsdorf,...
In DepthDetails PCBioAssay
TargetTransthyretin(Homo sapiens (Human))
The Scripps Research Institute Molecular Screening Center
Curated by PubChem BioAssay
LigandPNGBDBM96956(4-(1,3-benzothiazol-2-yl)-N-(5-methyl-1,3-thiazol-...)
Affinity DataEC50: >1.67E+5nM. Assay description: Source (MLPCN Center Name): The Scripps Research Institute Molecular Screening Center (SRIMSC) Affiliation: The Scripps Research Institute, TSRI Assa...
In DepthDetails PCBioAssay
TargetTransthyretin(Homo sapiens (Human))
The Scripps Research Institute Molecular Screening Center
Curated by PubChem BioAssay
LigandPNGBDBM96956(4-(1,3-benzothiazol-2-yl)-N-(5-methyl-1,3-thiazol-...)
Affinity DataIC50: >1.67E+5nM. Assay description: Source (MLPCN Center Name): The Scripps Research Institute Molecular Screening Center (SRIMSC) Affiliation: The Scripps Research Institute, TSRI Assa...
In DepthDetails PCBioAssay
TargetNuclear hormone receptor family member daf-12(Caenorhabditis elegans)
The Scripps Research Institute Molecular Screening Center
Curated by PubChem BioAssay
LigandPNGBDBM96956(4-(1,3-benzothiazol-2-yl)-N-(5-methyl-1,3-thiazol-...)
Affinity DataIC50:  6.75E+4nM. Assay description: Source (MLPCN Center Name): The Scripps Research Institute Molecular Screening Center Affiliation: UT Southwestern Assay Provider: David Mangelsdorf,...
In DepthDetails PCBioAssay