BDBM96962 (5R,6R)-6-(5-nitro-1,2,3,4-tetrazol-2-yl)-5-phenyl-3-thiophen-2-yl-cyclohex-2-en-1-one::(5R,6R)-6-(5-nitro-2-tetrazolyl)-5-phenyl-3-thiophen-2-yl-1-cyclohex-2-enone::(5R,6R)-6-(5-nitro-2H-tetrazol-2-yl)-5-phenyl-3-thien-2-ylcyclohex-2-en-1-one::(5R,6R)-6-(5-nitrotetrazol-2-yl)-5-phenyl-3-(2-thienyl)cyclohex-2-en-1-one::(5R,6R)-6-(5-nitrotetrazol-2-yl)-5-phenyl-3-thiophen-2-ylcyclohex-2-en-1-one::MLS000584935::SMR000207320::cid_1266353
SMILES [O-][N+](=O)c1nnn(n1)[C@@H]1[C@H](CC(=CC1=O)c1cccs1)c1ccccc1
InChI Key InChIKey=RRNWTPYCEVWZSQ-CZUORRHYSA-N
Data  1 EC50
  Tab Delimited (TSV)   2D SDfile   Computed 3D by Vconf -m prep SDfile
Find this compound or compounds like it in BindingDB:
Activity Spreadsheet -- Enzyme Inhibition Constant Data from BindingDB
Found 1 hit for monomerid = 96962
TargetProbable global transcription activator SNF2L2(Homo sapiens (Human))
The Scripps Research Institute Molecular Screening Center
Curated by PubChem BioAssay
LigandPNGBDBM96962((5R,6R)-6-(5-nitro-1,2,3,4-tetrazol-2-yl)-5-phenyl...)
Affinity DataEC50:  9.12E+4nM
In DepthDetails PCBioAssay